Uploaded image for project: 'odlparent'
  1. odlparent
  2. ODLPARENT-167

Error during blueprint generation: IllegalArgumentException (without further details)

    XMLWordPrintable

Details

    • Bug
    • Status: Resolved
    • Highest
    • Resolution: Done
    • 4.0.0
    • 4.0.1
    • None
    • Highest

    Description

      While working on the odlparent 4.0.0 bump in NEUTRON-197, I've come across a new problem with the blueprint-maven-plugin, after switching from pax-cdi-api to blueprint-maven-plugin-annotation as per https://wiki.opendaylight.org/view/Neon_platform_upgrade#Blueprint_declarations :

      [INFO] --- blueprint-maven-plugin:1.10.0:blueprint-generate (default) @ northbound-api ---
      [INFO] Package org.opendaylight will be scanned
      [INFO] ------------------------------------------------------------------------
      [INFO] Reactor Summary:
      [INFO] 
      [INFO] ODL :: neutron :: project-neutron-parent ........... SUCCESS [  6.772 s]
      [INFO] ODL :: neutron :: model ............................ SUCCESS [ 40.548 s]
      [INFO] ODL :: neutron :: neutron-spi ...................... SUCCESS [ 16.871 s]
      [INFO] ODL :: neutron :: northbound-api ................... FAILURE [  4.718 s]
      [INFO] ODL :: neutron :: transcriber ...................... SKIPPED
      [INFO] ODL :: neutron :: neutron-logger ................... SKIPPED
      [INFO] Neutron Artifacts .................................. SKIPPED
      [INFO] OpenDaylight :: Neutron :: Model ................... SKIPPED
      [INFO] OpenDaylight :: Neutron :: API ..................... SKIPPED
      [INFO] OpenDaylight :: Neutron :: Northbound .............. SKIPPED
      [INFO] OpenDaylight :: Neutron :: Service ................. SKIPPED
      [INFO] ODL :: neutron :: neutron-hostconfig-utils ......... SKIPPED
      [INFO] ODL :: neutron :: neutron-hostconfig-ovs ........... SKIPPED
      [INFO] OpenDaylight :: Neutron :: Hostconfig :: OVS ....... SKIPPED
      [INFO] ODL :: neutron :: neutron-hostconfig-vpp ........... SKIPPED
      [INFO] OpenDaylight :: Neutron :: Hostconfig :: VPP ....... SKIPPED
      [INFO] features-neutron-service ........................... SKIPPED
      [INFO] OpenDaylight :: Neutron :: Logger .................. SKIPPED
      [INFO] features-aggregator ................................ SKIPPED
      [INFO] ODL :: neutron :: integration-test-standalone ...... SKIPPED
      [INFO] OpenDaylight :: Neutron :: Logger :: Test .......... SKIPPED
      [INFO] features-neutron-test .............................. SKIPPED
      [INFO] features-test-aggregator ........................... SKIPPED
      [INFO] neutron-karaf ...................................... SKIPPED
      [INFO] ODL :: neutron :: neutron-hostconfig ............... SKIPPED
      [INFO] neutron ............................................ SKIPPED
      [INFO] ------------------------------------------------------------------------
      [INFO] BUILD FAILURE
      [INFO] ------------------------------------------------------------------------
      [INFO] Total time: 01:15 min
      [INFO] Finished at: 2018-09-17T15:05:54+02:00
      [INFO] Final Memory: 136M/1256M
      [INFO] ------------------------------------------------------------------------
      [ERROR] Failed to execute goal org.apache.aries.blueprint:blueprint-maven-plugin:1.10.0:blueprint-generate (default) on project northbound-api: Error during blueprint generation: IllegalArgumentException -> [Help 1]

       

      Attachments

        Issue Links

          No reviews matched the request. Check your Options in the drop-down menu of this sections header.

          Activity

            People

              vorburger Michael Vorburger
              vorburger Michael Vorburger
              Votes:
              0 Vote for this issue
              Watchers:
              4 Start watching this issue

              Dates

                Created:
                Updated:
                Resolved: